{"text_format":"1","workbook":"xlsx","n_sheets":2,"sheets":["Order Form","Sheet 2"],"not_rendered":{"charts":0,"images":0,"macros":1,"external_links":1,"defined_names":6,"comments":1,"pivot_tables":0},"unopened":[],"bounds":{"document_bytes":16777216,"sheet_cells":100000,"rows_first":2000,"rows_last":500,"rows_between":2000,"halvings":0,"cell_chars":16384,"cell_head_chars":4096},"cells_cut":0,"cells_raw":0,"read":"whole","date_system":"1900"}

{"sheet":"Order Form","index":0,"n_rows":733,"n_cols":12,"rows_kept":733,"cut":false,"hidden":false,"merged":[[8,4,8,8],[4,4,4,5],[6,4,7,4],[6,5,7,5],[6,7,7,7],[6,8,7,8],[6,0,6,2],[7,0,7,2],[0,0,0,8],[2,6,2,7],[4,6,4,7],[6,6,7,6],[2,0,2,2],[3,0,3,2],[4,0,4,2],[5,0,5,2],[2,4,2,5],[13,4,13,8],[11,4,11,8],[12,4,12,8],[10,0,13,2],[9,0,9,3],[10,3,10,8],[9,4,9,8]]}
["Wildland Equipment Order Form\nMN FIRE DEPARTMENT USE ONLY"]
[null,null,null,"Version 2026.1"]
["Fire Department Name",null,null,null,"Date of Order"]
["Shipping Address (No P.O. Boxes)"]
["City, State, Zip Code",null,null,null,"Date Needed"]
["Contact Name"]
["Phone #",null,null,null,"SHIP THIS ORDER",false,null,"PICKUP AT CACHE",false]
["Email"]
[]
["Enter the quantity of the item you would like below. ",null,null,null,"Completed forms must be emailed to:\nsm.fs.nekfirecache@usda.gov "]
["THIS PROGRAM SHOULD BE USED AS A RESOURCE OF LAST RESORT Equipment may be refurbished and not in new condition. Accountable property such as pumps, chainsaws, and portable generators cannot be sold through this program.\n\nThe equipment sales are offered as a service. Fire departments are encouraged to purchase wildland fire equipment through normal vendors. Vendors' prices may be similar, and products may better suit the needs of the fire department.\nALL SALES ARE FINAL",null,null,"The Cache is not involved in the billing or invoiceing process. Please do not send payment to the cache!"]
[null,null,null,"TOTAL COST WITHOUT SHIPPING",{"$f":"SUM(F16:F757)","v":{"$error":"#N/A"}}]
[null,null,null,"TOTAL ESTIMATED SHIPPING COST",{"$f":"IF(L14=TRUE,10,J14)","v":10}]
[null,null,null,"TOTAL OVERALL COST",{"$f":"SUM(E12:I13)","v":{"$error":"#N/A"}},null,null,null,null,{"$f":"SUM(I16:I757)","v":0},{"$f":"SUM(J14*0.8)","v":0},{"$f":"IF(K14<10,TRUE,FALSE)","v":true}]
["Item #","Qty","Unit of Issue","Description","Unit of Issue Cost","Total",null,"Weight","Total weight"]
[{"$f":"LEFT(D16, 6)","v":"000003"},0,"Each","000003 - ADAPTER - 1\" NPSH-F,(11 1/2 TPI) TO 1\" NH-M(8 TPI)",{"$f":"_xlfn.XLOOKUP(A16,'Sheet 2'!A:A,'Sheet 2'!B:B)","v":4.95},{"$f":"E16*B16","v":0},null,0.13,{"$f":"B16*H16","v":0}]
["000004",0,"Each","000004 - ADAPTER - 1\" NH-F,(9 TPI) TO 1\" NPSH-M (11 1/2 TPI)",{"$f":"_xlfn.XLOOKUP(A17,'Sheet 2'!A:A,'Sheet 2'!B:B)","v":5.01},0,null,0.13,0]
["000006",0,"Each","000006 - ADAPTER - 1 1/2\" NH-F, (9 TPI) TO 1 1/2\" NPSH-M (11 1/2 TPI)",{"$f":"_xlfn.XLOOKUP(A18,'Sheet 2'!A:A,'Sheet 2'!B:B)","v":15.57},0,null,0.25,0]
["000007",0,"Each","000007 - ADAPTER - 1 1/2\" NPSH-F, (11 1/2 TPI) TO 1 1/2\" NH-M (9TPI)",{"$f":"_xlfn.XLOOKUP(A19,'Sheet 2'!A:A,'Sheet 2'!B:B)","v":16.12},0,null,0.25,0]
["000009",0,"Each","000009 - REDUCER - 1 1/2\" NH-F (9 TPI) TO 1\" NH-M (8 TPI)",{"$f":"_xlfn.XLOOKUP(A20,'Sheet 2'!A:A,'Sheet 2'!B:B)","v":29.92},0,null,0.56000000000000005,0]
["000010",0,"Each","000010 - REDUCER - 1 1/2\" NH-F (9 TPI) TO 1\" NPSH-M (11 1/2 TPI)",{"$f":"_xlfn.XLOOKUP(A21,'Sheet 2'!A:A,'Sheet 2'!B:B)","v":13.58},0,null,0.19,0]
["000011",0,"Each","000011 - PULLER - FENCEPOST",{"$f":"_xlfn.XLOOKUP(A22,'Sheet 2'!A:A,'Sheet 2'!B:B)","v":112.37},0,null,14,0]
["000014",0,"Each","000014 - BAR - WRECKING, 5/8\" DIAMETER, 18\"",{"$f":"_xlfn.XLOOKUP(A23,'Sheet 2'!A:A,'Sheet 2'!B:B)","v":10.41},0,null,1.88,0]
["000021",0,"Box","000021 - BAG - GARBAGE CAN LINER, PLASTIC, 30 GL, 39\" X 33\"",{"$f":"_xlfn.XLOOKUP(A24,'Sheet 2'!A:A,'Sheet 2'!B:B)","v":29.89},0,null,20.75,0]
["000022",0,"Each","000022 - BAG - SLEEPING, COLD WEATHER, 34\" X 76\"",{"$f":"_xlfn.XLOOKUP(A25,'Sheet 2'!A:A,'Sheet 2'!B:B)","v":62.66},0,null,4.75,0]
["000024",0,"Each","000024 - NOZZLE - TWIN TIP, COMBINATION, 1'' NPSH-F",{"$f":"_xlfn.XLOOKUP(A26,'Sheet 2'!A:A,'Sheet 2'!B:B)","v":161.35},0,null,2.25,0]
["000028",0,"Pair","000028 - CHAPS - PROTECTIVE, SUMMER WEIGHT, 28\" LONG",{"$f":"_xlfn.XLOOKUP(A27,'Sheet 2'!A:A,'Sheet 2'!B:B)","v":146.66999999999999},0,null,0,0]
["000030",0,"PG","000030 - BATTERY - SIZE AA, 1.5 VOLT, PENLIGHT",{"$f":"_xlfn.XLOOKUP(A28,'Sheet 2'!A:A,'Sheet 2'!B:B)","v":9.26},0,null,1.25,0]
["000033",0,"PG","000033 - BATTERY - SIZE D,1.5V,ALKALINE,GENERAL PURPOSE",{"$f":"_xlfn.XLOOKUP(A29,'Sheet 2'!A:A,'Sheet 2'!B:B)","v":15.47},0,null,3.5,0]
["000037",0,"Each","000037 - CANTEEN - 1 QT (.9L), PLASTIC, DISPOSABLE, W/O COVER",{"$f":"_xlfn.XLOOKUP(A30,'Sheet 2'!A:A,'Sheet 2'!B:B)","v":2.0299999999999998},0,null,0.19,0]
["000045",0,"Pair","000045 - CHAPS - PROTECTIVE, SUMMER WEIGHT, 32\" LONG",{"$f":"_xlfn.XLOOKUP(A31,'Sheet 2'!A:A,'Sheet 2'!B:B)","v":146.66999999999999},0,null,3.75,0]
["000046",0,"Each","000046 - CLAMP - HOSE, SHUT-OFF, 1\" - 1 1/2\" HOSES, 10\" LONG WHEN CLOSED",{"$f":"_xlfn.XLOOKUP(A32,'Sheet 2'!A:A,'Sheet 2'!B:B)","v":53.07},0,null,1.44,0]
["000047",0,"Each","000047 - COMPASS - MAGNETIC, POCKET, AZIMUTH TYPE, 0-360 DEGREES",{"$f":"_xlfn.XLOOKUP(A33,'Sheet 2'!A:A,'Sheet 2'!B:B)","v":46.56},0,null,0.25,0]
["000048",0,"Box","000048 - CONTAINER - 5 GL (18.9L), PLASTIC, COLLAPSIBLE, W/OVERPACK",{"$f":"_xlfn.XLOOKUP(A34,'Sheet 2'!A:A,'Sheet 2'!B:B)","v":186.25},0,null,52,0]
["000049",0,"Each","000049 - PLIERS,12\" - ADJUSTABLE JOINT,ANGLE NOSE,MULTI TONGUE",{"$f":"_xlfn.XLOOKUP(A35,'Sheet 2'!A:A,'Sheet 2'!B:B)","v":15.47},0,null,1.81,0]
["000053",0,"Each","000053 - COT - FOLDING, 12 OZ COVER, 31\" X 77 1/2\"",{"$f":"_xlfn.XLOOKUP(A36,'Sheet 2'!A:A,'Sheet 2'!B:B)","v":88.26},0,null,18.75,0]
["000059",0,"Each","000059 - BAG - BURLAP, 50\" X 28 1/2\", W/PLASTIC LINER",{"$f":"_xlfn.XLOOKUP(A37,'Sheet 2'!A:A,'Sheet 2'!B:B)","v":8.76},0,null,1.19,0]
["000060",0,"Each","000060 - FILE - MILL, 10'', BASTARD",{"$f":"_xlfn.XLOOKUP(A38,'Sheet 2'!A:A,'Sheet 2'!B:B)","v":3.26},0,null,0.38,0]
["000061",0,"Set","000061 - GUIDE - FILE, 7/32\", W/FILE & HANDLE",{"$f":"_xlfn.XLOOKUP(A39,'Sheet 2'!A:A,'Sheet 2'!B:B)","v":7.61},0,null,0.38,0]
["000063",0,"Each","000063 - HANDLE - FILE, FOR 8\" TO 14\" FILES",{"$f":"_xlfn.XLOOKUP(A40,'Sheet 2'!A:A,'Sheet 2'!B:B)","v":2.46},0,null,0.13,0]
["000067",0,"Kit","000067 - KIT - FIRST AID, TYPE 1, POCKET",{"$f":"_xlfn.XLOOKUP(A41,'Sheet 2'!A:A,'Sheet 2'!B:B)","v":24.31},0,null,0.31,0]
["000070",0,"Each","000070 - FLY - PLASTIC TENT,16'X24' W/10 GUY ROPES",{"$f":"_xlfn.XLOOKUP(A42,'Sheet 2'!A:A,'Sheet 2'!B:B)","v":663.05},0,null,19.75,0]
["000071",0,"Roll","000071 - TAPE - DUCT, 2\" X 60 YD",{"$f":"_xlfn.XLOOKUP(A43,'Sheet 2'!A:A,'Sheet 2'!B:B)","v":7.68},{"$f":"E43*B43","v":0},null,1.75,0]
["000077",0,"Each","000077 - TENT - 2 PERSON",{"$f":"_xlfn.XLOOKUP(A44,'Sheet 2'!A:A,'Sheet 2'!B:B)","v":255.31},0,null,10.94,0]
["000078",0,"Pair","000078 - CHAPS - PROTECTIVE, SUMMER WEIGHT, 36\" LONG",{"$f":"_xlfn.XLOOKUP(A45,'Sheet 2'!A:A,'Sheet 2'!B:B)","v":146.66999999999999},0,null,4.25,0]
["000082",0,"Each","000082 - POLE, RIDGE - FOR 10' X 12' TENT",{"$f":"_xlfn.XLOOKUP(A46,'Sheet 2'!A:A,'Sheet 2'!B:B)","v":85.38},0,null,16.2,0]
["000083",0,"Each","000083 - POLE - UPRIGHT, ADJUSTABLE",{"$f":"_xlfn.XLOOKUP(A47,'Sheet 2'!A:A,'Sheet 2'!B:B)","v":60.91},0,null,7.38,0]
["000084",0,"Each","000084 - TENT - WALL, 14' X 16', WITHOUT POLES",{"$f":"_xlfn.XLOOKUP(A48,'Sheet 2'!A:A,'Sheet 2'!B:B)","v":689.68},0,null,96,0]
["000086",0,"Pad","000086 - FORM - I/A HELICOPTER PASS/CARGO MANIFEST, OF-252",{"$f":"_xlfn.XLOOKUP(A49,'Sheet 2'!A:A,'Sheet 2'!B:B)","v":8.65},0,null,0.25,0]
["000089",0,"Each","000089 - POLE - RIDGE,16'",{"$f":"_xlfn.XLOOKUP(A50,'Sheet 2'!A:A,'Sheet 2'!B:B)","v":184.17},0,null,22.75,0]
["000090",0,"Each","000090 - TANK - COLLAPSIBLE - 1200 GL (4542L), FREE STANDING 44'' DEPTH, OPENING 61''",{"$f":"_xlfn.XLOOKUP(A51,'Sheet 2'!A:A,'Sheet 2'!B:B)","v":895.77},0,null,68,0]
["000105",0,"Box","000105 - FUSEE - SIGNAL DEVICE, HAND",{"$f":"_xlfn.XLOOKUP(A52,'Sheet 2'!A:A,'Sheet 2'!B:B)","v":143.16999999999999},0,null,37.5,0]
["000113",0,"Each","000113 - FUEL LINE ASSEMBLY - 1/4\" X 5' W/FITTINGS",{"$f":"_xlfn.XLOOKUP(A53,'Sheet 2'!A:A,'Sheet 2'!B:B)","v":57.72},0,null,1,0]
["000114",0,"Length","000114 - HOSE - COTTON SYNTHETIC JACKET,1 1/2\" NH X 3', RUBBER LINED",{"$f":"_xlfn.XLOOKUP(A54,'Sheet 2'!A:A,'Sheet 2'!B:B)","v":38.909999999999997},0,null,2.38,0]
["000115",0,"Length","000115 - HOSE - SUCTION, 1 1/2\" NH X 10', RUBBER, RCKR LUG COUPL,9 NSHT/IN",{"$f":"_xlfn.XLOOKUP(A55,'Sheet 2'!A:A,'Sheet 2'!B:B)","v":214.15},0,null,8.8800000000000008,0]
["000126",0,"Kit","000126 - KIT - WASH, ASSEMBLY",{"$f":"_xlfn.XLOOKUP(A56,'Sheet 2'!A:A,'Sheet 2'!B:B)","v":12.96},0,null,1.06,0]
["000128",0,"Each","000128 - BAG - SLEEPING, COLD WEATHER, 35\" X 81\" (2012)",{"$f":"_xlfn.XLOOKUP(A57,'Sheet 2'!A:A,'Sheet 2'!B:B)","v":116.97},0,null,4.5,0]
["000131",0,"Each","000131 - RESPIRATOR - N95 PARTICULATE, NIOSH APPROVED",{"$f":"_xlfn.XLOOKUP(A58,'Sheet 2'!A:A,'Sheet 2'!B:B)","v":0.98},0,null,0.06,0]
["000135",0,"Kit","000135 - MESS GEAR - DISPOSABLE 25-PERSON, 1 DAY",{"$f":"_xlfn.XLOOKUP(A59,'Sheet 2'!A:A,'Sheet 2'!B:B)","v":70.11},0,null,8.3800000000000008,0]
["000136",0,"Each","000136 - NOZZLE - GARDEN HOSE, 3/4\" NH, ADJUSTABLE, BRASS",{"$f":"_xlfn.XLOOKUP(A60,'Sheet 2'!A:A,'Sheet 2'!B:B)","v":22.06},0,null,0.44,0]
["000137",0,"Each","000137 - NOZZLE - PLASTIC, 60 GPM, 1 1/2'' NH-F X 4 3/4'' LONG",{"$f":"_xlfn.XLOOKUP(A61,'Sheet 2'!A:A,'Sheet 2'!B:B)","v":8.33},0,null,0.63,0]
["000138",0,"Each","000138 - NOZZLE - PLASTIC, 35 GPM, 1'' NPSH-F",{"$f":"_xlfn.XLOOKUP(A62,'Sheet 2'!A:A,'Sheet 2'!B:B)","v":8.64},0,null,0.5,0]
["000141",0,"Each","000141 - PAIL - COLLAPSIBLE, W/CARRYING HANDLE",{"$f":"_xlfn.XLOOKUP(A63,'Sheet 2'!A:A,'Sheet 2'!B:B)","v":10.46},0,null,0.5,0]
["000142",0,"Box","000142 - PAPER - TOILET",{"$f":"_xlfn.XLOOKUP(A64,'Sheet 2'!A:A,'Sheet 2'!B:B)","v":68.459999999999994},0,null,44,0]
["000143",0,"Roll","000143 - SHEETING - PLASTIC, CLEAR, 16' X 100'",{"$f":"_xlfn.XLOOKUP(A65,'Sheet 2'!A:A,'Sheet 2'!B:B)","v":67.8},0,null,21.88,0]
["000144",0,"Roll","000144 - SHEETING - PLASTIC, BLACK, 20' X 100'",{"$f":"_xlfn.XLOOKUP(A66,'Sheet 2'!A:A,'Sheet 2'!B:B)","v":84.53},0,null,44,0]
["000145",0,"Each","000145 - PRIMER - HAND, MARK 3",{"$f":"_xlfn.XLOOKUP(A67,'Sheet 2'!A:A,'Sheet 2'!B:B)","v":116.49},0,null,2.25,0]
["000146",0,"Each","000146 - PULASKI - WITH PLASTIC SHEATH",{"$f":"_xlfn.XLOOKUP(A68,'Sheet 2'!A:A,'Sheet 2'!B:B)","v":72.680000000000007},0,null,5.88,0]
["000149",0,"Each","000149 - PUMP - BARREL, HAND, W/UNLEADED NOZZLE, FOR 55 GL DRUM",{"$f":"_xlfn.XLOOKUP(A69,'Sheet 2'!A:A,'Sheet 2'!B:B)","v":278.56},0,null,15.75,0]
["000150",0,"Pair","000150 - CHAPS - PROTECTIVE, SUMMER WEIGHT, 40\" LONG",{"$f":"_xlfn.XLOOKUP(A70,'Sheet 2'!A:A,'Sheet 2'!B:B)","v":146.66999999999999},0,null,2.44,0]
["000151",0,"Each","000151 - PUMP - TROMBONE, BACKPACK, SINGLE ACTION",{"$f":"_xlfn.XLOOKUP(A71,'Sheet 2'!A:A,'Sheet 2'!B:B)","v":70.67},0,null,2.63,0]
["000171",0,"Each","000171 - SHOVEL - WITH PLASTIC SHEATH, SIZE #1",{"$f":"_xlfn.XLOOKUP(A72,'Sheet 2'!A:A,'Sheet 2'!B:B)","v":91.53},0,null,4.88,0]
["000177",0,"Each","000177 - SIGN - DANGER NO SMOKING, POLYVINYL, 14\" X 11\"",{"$f":"_xlfn.XLOOKUP(A73,'Sheet 2'!A:A,'Sheet 2'!B:B)","v":6.39},0,null,0.1,0]
["000178",0,"Each","000178 - SIGN - DIRECTION ARROW, WHITE TAG, 14\" X 11\"",{"$f":"_xlfn.XLOOKUP(A74,'Sheet 2'!A:A,'Sheet 2'!B:B)","v":1.47},0,null,0.06,0]
["000184",0,"Each","000184 - SIGN - ADA PARKING, POLYVINYL, 12\" x 16\"",{"$f":"_xlfn.XLOOKUP(A75,'Sheet 2'!A:A,'Sheet 2'!B:B)","v":12.03},0,null,0.1,0]
["000185",0,"Each","000185 - SIGN - PARKING, POLYVINYL, 14\" X 10\"",{"$f":"_xlfn.XLOOKUP(A76,'Sheet 2'!A:A,'Sheet 2'!B:B)","v":6.5},0,null,0.06,0]
["000186",0,"Each","000186 - SIGN - NO PARKING, POLYVINYL, 14'' X 10''",{"$f":"_xlfn.XLOOKUP(A77,'Sheet 2'!A:A,'Sheet 2'!B:B)","v":12.89},0,null,0.1,0]
["000189",0,"Each","000189 - SIGN - BLANK, WHITE TAG, 14\" X 11\"",{"$f":"_xlfn.XLOOKUP(A78,'Sheet 2'!A:A,'Sheet 2'!B:B)","v":0.69},0,null,0.1,0]
["000196",0,"Each","000196 - SIGN - DANGER KEEP OUT, POLYVINYL, 14'' X 10''",{"$f":"_xlfn.XLOOKUP(A79,'Sheet 2'!A:A,'Sheet 2'!B:B)","v":11.91},0,null,0.1,0]
[{"$f":"LEFT(D80, 6)","v":"000197"},0,"Each","000197 - SIGN - RESTROOM WOMEN, WHITE TAG, 12\" X 12\"",{"$f":"_xlfn.XLOOKUP(A80,'Sheet 2'!A:A,'Sheet 2'!B:B)","v":4.32},0,null,0.1,{"$f":"B80*H80","v":0}]
["000206",0,"Each","000206 - WASHCLOTH - WATERLESS, CLEANSING, 10\" X 11 1/2\"",{"$f":"_xlfn.XLOOKUP(A81,'Sheet 2'!A:A,'Sheet 2'!B:B)","v":0.21},0,null,0.06,0]
["000212",0,"Each","000212 - VALVE - FOOT, 1 1/2\" NH-F W/STRAINER",{"$f":"_xlfn.XLOOKUP(A82,'Sheet 2'!A:A,'Sheet 2'!B:B)","v":87.78},0,null,1.88,0]
["000213",0,"Each","000213 - STRAP - CHIN, SAFETY HELMET, BULLARD ES-42",{"$f":"_xlfn.XLOOKUP(A83,'Sheet 2'!A:A,'Sheet 2'!B:B)","v":4.6500000000000004},0,null,0.06,0]
["000216",0,"Each","000216 - TAG - SHIPPING (BLANK)",{"$f":"_xlfn.XLOOKUP(A84,'Sheet 2'!A:A,'Sheet 2'!B:B)","v":0.24},0,null,0.06,0]
["000218",0,"Each","000218 - TANK, GASOLINE - 5 GL (18.9L), PUMP ADAPTED",{"$f":"_xlfn.XLOOKUP(A85,'Sheet 2'!A:A,'Sheet 2'!B:B)","v":181.15},0,null,10.88,0]
["000222",0,"Roll","000222 - TAPE - FILAMENT, 1\" X 60 YD",{"$f":"_xlfn.XLOOKUP(A86,'Sheet 2'!A:A,'Sheet 2'!B:B)","v":5.4},0,null,0.63,0]
["000223",0,"Each","000223 - TENT - WALL, 10' X 12', WITHOUT POLES",{"$f":"_xlfn.XLOOKUP(A87,'Sheet 2'!A:A,'Sheet 2'!B:B)","v":434.1},0,null,56.2,0]
["000224",0,"Each","000224 - INSTRUCTIONS - LIGHTWEIGHT PUMP",{"$f":"_xlfn.XLOOKUP(A88,'Sheet 2'!A:A,'Sheet 2'!B:B)","v":0},0,null,0.2,0]
["000228",0,"Each","000228 - VALVE - AUTOMATIC CHECK AND BLEEDER 1 1/2\" NH-F",{"$f":"_xlfn.XLOOKUP(A89,'Sheet 2'!A:A,'Sheet 2'!B:B)","v":132.81},0,null,2.56,0]
["000229",0,"Each","000229 - VALVE - PRESSURE RELIEF, 1 1/2\" NH-F",{"$f":"_xlfn.XLOOKUP(A90,'Sheet 2'!A:A,'Sheet 2'!B:B)","v":104.38},0,null,1.38,0]
["000230",0,"Each","000230 - TEE - HOSELINE, W/VALVE, 1 1/2\" NH-F X 1 1/2\" NH-M X 1\" NPSH-M",{"$f":"_xlfn.XLOOKUP(A91,'Sheet 2'!A:A,'Sheet 2'!B:B)","v":47.09},0,null,0.94,0]
["000231",0,"Each","000231 - VALVE - WYE, GATED, 1 1/2'' NH-F X 1 1/2'' NH-M X 1 1/2'' NH-M",{"$f":"_xlfn.XLOOKUP(A92,'Sheet 2'!A:A,'Sheet 2'!B:B)","v":125.63},0,null,3.75,0]
["000234",0,"Each","000234 - WRENCH - SPANNER, 5\", 1\" TO 1 1/2\" HOSE SIZE",{"$f":"_xlfn.XLOOKUP(A93,'Sheet 2'!A:A,'Sheet 2'!B:B)","v":6.46},0,null,0.38,0]
["000235",0,"Each","000235 - WRENCH - SPANNER, 11\", 1 1/2\" TO 2 1/2\" HOSE SIZE",{"$f":"_xlfn.XLOOKUP(A94,'Sheet 2'!A:A,'Sheet 2'!B:B)","v":11.08},0,null,0.63,0]
["000240",0,"Box","000240 - TOWEL - PAPER, TWO PLY, ROLL",{"$f":"_xlfn.XLOOKUP(A95,'Sheet 2'!A:A,'Sheet 2'!B:B)","v":31.1},0,null,41,0]
["000241",0,"Each","000241 - TORCH - DRIP, 1 1/4 GL (4.7L) CAPACITY",{"$f":"_xlfn.XLOOKUP(A96,'Sheet 2'!A:A,'Sheet 2'!B:B)","v":214.72},0,null,5.13,0]
["000247",0,"Each","000247 - HANDLE - SLIDING T, 1/2\" DRIVE",{"$f":"_xlfn.XLOOKUP(A97,'Sheet 2'!A:A,'Sheet 2'!B:B)","v":27.91},0,null,0.94,0]
["000248",0,"Each","000248 - PLIERS - SLIP JOINT 8\" LONG",{"$f":"_xlfn.XLOOKUP(A98,'Sheet 2'!A:A,'Sheet 2'!B:B)","v":11.34},0,null,0.63,0]
["000250",0,"Pad","000250 - PAPER - EASEL, 27\" X 34\"",{"$f":"_xlfn.XLOOKUP(A99,'Sheet 2'!A:A,'Sheet 2'!B:B)","v":22.29},0,null,6.38,0]
["000251",0,"Each","000251 - CLOTH - OIL SORBENT, 36\" X 36\" X 3/8\"",{"$f":"_xlfn.XLOOKUP(A100,'Sheet 2'!A:A,'Sheet 2'!B:B)","v":2.88},0,null,0.69,0]
["000254",0,"Each","000254 - GASKET - HOSE, 1 1/2\"",{"$f":"_xlfn.XLOOKUP(A101,'Sheet 2'!A:A,'Sheet 2'!B:B)","v":0.34},0,null,0.06,0]
["000256",0,"Each","000256 - SCREWDRIVER - FLAT TIP, 2\"",{"$f":"_xlfn.XLOOKUP(A102,'Sheet 2'!A:A,'Sheet 2'!B:B)","v":2.23},0,null,0.06,0]
["000258",0,"Each","000258 - PULASKI - W/42\" FIBERGLASS HANDLE",{"$f":"_xlfn.XLOOKUP(A103,'Sheet 2'!A:A,'Sheet 2'!B:B)","v":73.83},0,null,6.8,0]
["000259",0,"Each","000259 - VALVE - WYE, GATED, 1\" NPSH-F X 1\" NPSH-M X 1\" NPSH-M",{"$f":"_xlfn.XLOOKUP(A104,'Sheet 2'!A:A,'Sheet 2'!B:B)","v":124.55},0,null,2.44,0]
["000260",0,"Kit","000260 - KIT - PUMP TOOL ROLL, FIRE, PORTABLE",{"$f":"_xlfn.XLOOKUP(A105,'Sheet 2'!A:A,'Sheet 2'!B:B)","v":141.44},0,null,4,0]
["000262",0,"Each","000262 - WRENCH - BOX, OPEN END, 10MM OFFSET, MARK 3, PACIFIC R-906",{"$f":"_xlfn.XLOOKUP(A106,'Sheet 2'!A:A,'Sheet 2'!B:B)","v":13.93},0,null,0.19,0]
["000263",0,"Each","000263 - SCREWDRIVER - FLAT TIP, DOUBLE BEND, 3\"",{"$f":"_xlfn.XLOOKUP(A107,'Sheet 2'!A:A,'Sheet 2'!B:B)","v":5.86},{"$f":"E107*B107","v":0},null,0.06,0]
["000264",0,"Roll","000264 - RIBBON - FLAGGING, WHITE, 1\" WIDE",{"$f":"_xlfn.XLOOKUP(A108,'Sheet 2'!A:A,'Sheet 2'!B:B)","v":0.84},0,null,0.5,0]
["000267",0,"Roll","000267 - RIBBON - FLAGGING,HAZARDS,1'' WIDE",{"$f":"_xlfn.XLOOKUP(A109,'Sheet 2'!A:A,'Sheet 2'!B:B)","v":3.74},0,null,0.44,0]
["000268",0,"Each","000268 - PUNCH - PAPER,3 HOLE",{"$f":"_xlfn.XLOOKUP(A110,'Sheet 2'!A:A,'Sheet 2'!B:B)","v":51.75},0,null,3.19,0]
["000278",0,"Roll","000278 - RIBBON - FLAGGING, YELLOW, 1\" WIDE",{"$f":"_xlfn.XLOOKUP(A111,'Sheet 2'!A:A,'Sheet 2'!B:B)","v":2.59},0,null,0.38,0]
["000279",0,"Roll","000279 - RIBBON - FLAGGING, RED, 1\" WIDE",{"$f":"_xlfn.XLOOKUP(A112,'Sheet 2'!A:A,'Sheet 2'!B:B)","v":2.46},0,null,0.38,0]
["000281",0,"Each","000281 - BAG - TENT, PERSONAL GEAR PACK",{"$f":"_xlfn.XLOOKUP(A113,'Sheet 2'!A:A,'Sheet 2'!B:B)","v":33.33},0,null,1.25,0]
["000288",0,"Each","000288 - CLOCK - DIGITAL, BATTERY OPERATED,W/ALARM,12/24 HOUR",{"$f":"_xlfn.XLOOKUP(A114,'Sheet 2'!A:A,'Sheet 2'!B:B)","v":15.55},0,null,0.44,0]
["000290",0,"Each","000290 - SCREWDRIVER - FLAT TIP, 6\"",{"$f":"_xlfn.XLOOKUP(A115,'Sheet 2'!A:A,'Sheet 2'!B:B)","v":8.18},0,null,0.31,0]
["000291",0,"Each","000291 - PLIERS - SLIP JOINT 6\" LONG",{"$f":"_xlfn.XLOOKUP(A116,'Sheet 2'!A:A,'Sheet 2'!B:B)","v":9.4700000000000006},0,null,0.31,0]
["000294",0,"Each","000294 - HARNESS - CHEST, FIRE SHELTER",{"$f":"_xlfn.XLOOKUP(A117,'Sheet 2'!A:A,'Sheet 2'!B:B)","v":19.260000000000002},0,null,0.44,0]
["000296",0,"Each","000296 - MC LEOD - WITH PLASTIC SHEATH, 11\" WIDE",{"$f":"_xlfn.XLOOKUP(A118,'Sheet 2'!A:A,'Sheet 2'!B:B)","v":68.489999999999995},0,null,6.19,0]
["000305",0,"Each","000305 - CARTON - FIBERBOARD, 56\" X 20\" X 11\"",{"$f":"_xlfn.XLOOKUP(A119,'Sheet 2'!A:A,'Sheet 2'!B:B)","v":52.58},0,null,13.13,0]
["000307",0,"Each","000307 - EXTINGUISHER - FIRE,20A:120BC, 20 LBS",{"$f":"_xlfn.XLOOKUP(A120,'Sheet 2'!A:A,'Sheet 2'!B:B)","v":154.68},0,null,40,0]
{"$rows_left_out":614}
{"sheet":"Sheet 2","index":1,"n_rows":4004,"n_cols":9,"rows_kept":4004,"cut":false,"hidden":false,"merged":[]}
["Item ID","Cost",null,null,null,6,null,"January",1]
["000002",4.32,null,null,null,7,null,"February",2]
["000003",4.95,null,null,null,4,null,"March",3]
["000004",5.01,null,null,null,3,null,"April",4]
["000006",15.57,null,null,null,46,null,"May",5]
["000007",16.12,null,null,null,857,null,"June",6]
["000009",29.92,null,null,null,710,null,"July",7]
["000010",13.58,null,null,null,856,null,"August",8]
["000011",112.37,null,null,null,916,null,"September",9]
["000012",26.21,null,null,null,429,null,"October",10]
["000013",45.32,null,null,null,428,null,"November",11]
["000014",10.41,null,null,null,1145,null,"December",12]
["000015",40,null,null,null,105,null,null,13]
["000016",39.549999999999997,null,null,null,743,null,null,14]
["000017",0.85,null,null,null,254,null,null,15]
["000018",249.51,null,null,null,721,null,null,16]
["000020",79.81,null,null,null,1296,null,null,17]
["000021",29.89,null,null,null,1295,null,null,18]
["000022",62.66,null,null,null,1294,null,null,19]
["000024",161.35,null,null,null,1297,null,null,20]
["000027",5.01,null,null,null,1293,null,null,21]
["000028",146.66999999999999,null,null,null,318,null,null,22]
["000030",9.26,null,null,null,1086,null,null,23]
["000033",15.47,null,null,null,718,null,null,24]
["000034",13.64,null,null,null,7291,null,null,25]
["000035",7.59,null,null,null,7287,null,null,26]
["000037",2.0299999999999998,null,null,null,1016,null,null,27]
["000038",10.08,null,null,null,7629,null,null,28]
["000040",115,null,null,null,115,null,null,29]
["000043",25.74,null,null,null,1239,null,null,30]
["000045",146.66999999999999,null,null,null,1238,null,null,31]
["000046",53.07,null,null,null,1808]
["000047",46.56,null,null,null,2800]
["000048",186.25,null,null,null,2841]
["000049",15.47,null,null,null,2700]
["000050",209.16,null,null,null,2801]
["000052",5.01,null,null,null,2843]
["000053",88.26,null,null,null,2701]
["000054",3.1,null,null,null,2844]
["000058",85.55,null,null,null,2802]
["000059",8.76,null,null,null,2702]
["000060",3.26,null,null,null,2803]
["000061",7.61,null,null,null,2845]
["000062",42,null,null,null,2703]
["000063",2.46,null,null,null,2804]
["000064",530,null,null,null,2847]
["000066",6.79,null,null,null,2704]
["000067",24.31,null,null,null,2805]
["000069",11.58,null,null,null,2848]
["000070",663.05,null,null,null,2705]
["000071",7.68,null,null,null,2806]
["000072",42,null,null,null,2849]
["000074",1.31,null,null,null,2706]
["000075",4.13,null,null,null,2807]
["000077",255.31,null,null,null,2850]
["000078",146.66999999999999,null,null,null,2707]
["000079",9.4600000000000009,null,null,null,2842]
["000081",15.87,null,null,null,2846]
["000082",85.38,null,null,null,2851]
["000083",60.91,null,null,null,597]
["000084",689.68,null,null,null,296]
["000085",51.43,null,null,null,24]
["000086",8.65,null,null,null,628]
["000087",4.84,null,null,null,629]
["000088",3.55,null,null,null,627]
["000089",184.17,null,null,null,136]
["000090",895.77,null,null,null,138]
["000091",88.77,null,null,null,137]
["000092",193.11,null,null,null,674]
["000093",137.5,null,null,null,679]
["000094",10.87,null,null,null,146]
["000096",37.44,null,null,null,1149]
["000097",56.45,null,null,null,151]
["000098",14.31,null,null,null,659]
["000100",8.1199999999999992,null,null,null,1807]
["000103",320.93,null,null,null,10]
["000104",1586.81,null,null,null,733]
["000105",143.16999999999999,null,null,null,2230]
["000106",20.25,null,null,null,257]
["000109",52.33,null,null,null,975]
["000113",57.72,null,null,null,925]
["000114",38.909999999999997,null,null,null,579]
["000115",214.15,null,null,null,578]
["000116",46.13,null,null,null,569]
["000117",43.73,null,null,null,577]
["000118",556.41999999999996,null,null,null,580]
["000119",95.46,null,null,null,570]
["000120",1425.75,null,null,null,2078]
["000121",1359.29,null,null,null,511]
["000124",679.84,null,null,null,2079]
["000126",12.96,null,null,null,522]
["000128",116.97,null,null,null,512]
["000129",3.3,null,null,null,2910]
["000131",0.98,null,null,null,2911]
["000132",11.34,null,null,null,171]
["000135",70.11,null,null,null,1274]
["000136",22.06,null,null,null,1868]
["000137",8.33,null,null,null,731]
["000138",8.64,null,null,null,230]
["000139",3.93,null,null,null,1180]
["000140",11.49,null,null,null,241]
["000141",10.46,null,null,null,228]
["000142",68.459999999999994,null,null,null,212]
["000143",67.8,null,null,null,231]
["000144",84.53,null,null,null,259]
["000145",116.49,null,null,null,229]
["000146",72.680000000000007,null,null,null,235]
["000147",6826.9,null,null,null,234]
["000148",5354.46]
["000149",278.56]
["000150",146.66999999999999]
["000151",70.67]
["000152",7.89]
["000153",8.27]
["000159",1347.75]
["000171",91.53]
["000177",6.39]
["000178",1.47]
["000184",12.03]
["000185",6.5]
{"$rows_left_out":3884}