{"text_format":"1","workbook":"xlsx","n_sheets":2,"sheets":["Order Form","Price List"],"not_rendered":{"charts":0,"images":0,"macros":1,"external_links":1,"defined_names":3,"comments":1,"pivot_tables":0},"unopened":[],"bounds":{"document_bytes":16777216,"sheet_cells":100000,"rows_first":2000,"rows_last":500,"rows_between":2000,"halvings":0,"cell_chars":16384,"cell_head_chars":4096},"cells_cut":0,"cells_raw":0,"read":"whole","date_system":"1900"}

{"sheet":"Order Form","index":0,"n_rows":129,"n_cols":9,"rows_kept":129,"cut":false,"hidden":false,"merged":[[10,1,10,2],[10,4,10,8],[4,6,4,8],[8,4,8,8],[6,4,7,8],[4,4,4,5],[0,6,0,8],[0,0,0,5],[9,4,9,8],[2,0,2,2],[3,0,3,2],[4,0,4,2],[5,0,5,2],[2,4,2,5],[6,0,6,2],[7,0,7,2],[2,6,2,8],[11,4,11,8],[9,0,9,2]]}
["Wildland Equipment Order Form/Invoice ",null,null,null,null,null,"MN-RFD-"]
[null,null,null,"Version 2025.1"]
["Fire Department Name",null,null,null,"Date"]
["Shipping Address (No P.O. Boxes)"]
["City, State, Zip Code",null,null,null,"Date Needed"]
["Contact Name"]
["Phone #",null,null,null,"Signature: ___________________________________________________"]
["Email"]
[]
["Enter the quantity of the item you would like below then click filter.",null,null,"        Pickup","Completed forms can be mailed or emailed to:"]
[null,null,null,"Ship      ","Northeast Interagency Support Cache                                                                      402 SE 11th Street                                                                                                                                    Grand Rapids, MN 55744                                                                             218-322-2764                            "]
[null,null,null,null,"sm.fs.nekfirecache@usda.gov"]
["Item #","Qty","Unit of Issue","Description","Unit of Issue Cost","Total",null,"Weight","Total weight"]
[6,0,"EA","ADAPTER - 1 1/2\" NH-F, (9 TPI) TO 1 1/2\" NPSH-M (11 1/2 TPI)",{"$f":"_xlfn.XLOOKUP(A14,'Price List'!A:A,'Price List'!B:B)","v":16.05},{"$f":"E14*B14","v":0},null,0.25,{"$f":"B14*H14","v":0}]
[7,0,"EA","ADAPTER - 1 1/2\" NPSH-F, (11 1/2 TPI) TO 1 1/2\" NH-M (9TPI)",{"$f":"_xlfn.XLOOKUP(A15,'Price List'!A:A,'Price List'!B:B)","v":16.05},0,null,0.25,0]
[4,0,"EA","ADAPTER - 1\" NH-F,(9 TPI) TO 1\" NPSH-M (11 1/2 TPI)",{"$f":"_xlfn.XLOOKUP(A16,'Price List'!A:A,'Price List'!B:B)","v":5.01},0,null,0.13,0]
[3,0,"EA","ADAPTER - 1\" NPSH-F,(11 1/2 TPI) TO 1\" NH-M(8 TPI)",{"$f":"_xlfn.XLOOKUP(A17,'Price List'!A:A,'Price List'!B:B)","v":4.95},0,null,0.13,0]
[46,0,"EA","CLAMP - HOSE, SHUT-OFF, 1\" - 1 1/2\" HOSES",{"$f":"_xlfn.XLOOKUP(A18,'Price List'!A:A,'Price List'!B:B)","v":53.94},0,null,1.44,0]
[857,0,"EA","COUPLING - DOUBLE FEMALE 1 1/2\" NH-F (9 TPI)",{"$f":"_xlfn.XLOOKUP(A19,'Price List'!A:A,'Price List'!B:B)","v":26.76},0,null,1.19,0]
[710,0,"EA","COUPLING - DOUBLE FEMALE, 1'' NPSH (11 1/2 TPI)",{"$f":"_xlfn.XLOOKUP(A20,'Price List'!A:A,'Price List'!B:B)","v":17.11},0,null,0.19,0]
[856,0,"EA","COUPLING - DOUBLE MALE 1 1/2\" NH-M (9-TPI)",{"$f":"_xlfn.XLOOKUP(A21,'Price List'!A:A,'Price List'!B:B)","v":18.690000000000001},0,null,1,0]
[916,0,"EA","COUPLING - DOUBLE MALE, 1\" NPSH TO 1\" NPSH",{"$f":"_xlfn.XLOOKUP(A22,'Price List'!A:A,'Price List'!B:B)","v":15.22},0,null,0.31,0]
[429,0,"EA","FITTING - BACKPACK PUMP, FEMALE",{"$f":"_xlfn.XLOOKUP(A23,'Price List'!A:A,'Price List'!B:B)","v":9.65},0,null,0.31,0]
[428,0,"EA","FITTING - BACKPACK PUMP, MALE",{"$f":"_xlfn.XLOOKUP(A24,'Price List'!A:A,'Price List'!B:B)","v":7.13},0,null,0.13,0]
[1145,0,"PL","FOAM, CLASS A",{"$f":"_xlfn.XLOOKUP(A25,'Price List'!A:A,'Price List'!B:B)","v":128.33000000000001},0,null,43.63,0]
[105,0,"BX","FUSEE - SIGNAL DEVICE, HAND  (72 PER BOX)                                                                               (HAZMAT ITEM - ADDITIONAL SHIPPING COSTS WILL APPLY)",{"$f":"_xlfn.XLOOKUP(A26,'Price List'!A:A,'Price List'!B:B)","v":143.16999999999999},0,null,37.5,0]
[743,0,"EA","GASKET - HOSE, 1\", RUBBER",{"$f":"_xlfn.XLOOKUP(A27,'Price List'!A:A,'Price List'!B:B)","v":0.48},0,null,0.06,0]
[254,0,"EA","GASKET - HOSE, 1.5\"",{"$f":"_xlfn.XLOOKUP(A28,'Price List'!A:A,'Price List'!B:B)","v":0.37},0,null,0.06,0]
[721,0,"EA","GASKET, GARDEN HOSE 3/4\"",{"$f":"_xlfn.XLOOKUP(A29,'Price List'!A:A,'Price List'!B:B)","v":0.24},0,null,0.06,0]
[1296,0,"PR","GLOVES - LARGE",{"$f":"_xlfn.XLOOKUP(A30,'Price List'!A:A,'Price List'!B:B)","v":21.68},0,null,0.44,0]
[1295,0,"PR","GLOVES - MEDIUM",{"$f":"_xlfn.XLOOKUP(A31,'Price List'!A:A,'Price List'!B:B)","v":21.68},0,null,0.38,0]
[1294,0,"PR","GLOVES - SMALL",{"$f":"_xlfn.XLOOKUP(A32,'Price List'!A:A,'Price List'!B:B)","v":21.68},0,null,0.31,0]
[1297,0,"PR","GLOVES - X-LARGE",{"$f":"_xlfn.XLOOKUP(A33,'Price List'!A:A,'Price List'!B:B)","v":21.68},0,null,0.5,0]
[1293,0,"PR","GLOVES - X-SMALL",{"$f":"_xlfn.XLOOKUP(A34,'Price List'!A:A,'Price List'!B:B)","v":21.68},0,null,0.31,0]
[318,0,"PR","GOGGLES, UVEX, CLEAR LENSE",{"$f":"_xlfn.XLOOKUP(A35,'Price List'!A:A,'Price List'!B:B)","v":22.02},0,null,0.25,0]
[1086,0,"EA","HARNESS - RADIO HOLDER CHEST",{"$f":"_xlfn.XLOOKUP(A36,'Price List'!A:A,'Price List'!B:B)","v":91.29},0,null,0.56000000000000005,0]
[718,0,"EA","HEADLAMP - FIREFIGHTERS, LED",{"$f":"_xlfn.XLOOKUP(A37,'Price List'!A:A,'Price List'!B:B)","v":57.15},0,null,0.65,0]
[7291,0,"EA","HELMET - FULL BRIM, YELLOW, BULLARD, 911H",{"$f":"_xlfn.XLOOKUP(A38,'Price List'!A:A,'Price List'!B:B)","v":58.43},0,null,2,0]
[7287,0,"EA","HELMET,SAFETY,PLASTIC CAP STYLE",{"$f":"_xlfn.XLOOKUP(A39,'Price List'!A:A,'Price List'!B:B)","v":44.94},0,null,0,0]
[1016,0,"LG","HOSE – GARDEN, SYNTHETIC,  3/4\" NH X 50 FT",{"$f":"_xlfn.XLOOKUP(A40,'Price List'!A:A,'Price List'!B:B)","v":32.9},0,null,1.25,0]
[7629,0,"LG","HOSE - HOTLINE 1\" NPSH X 50'",{"$f":"_xlfn.XLOOKUP(A41,'Price List'!A:A,'Price List'!B:B)","v":82.02},0,null,5,0]
[115,0,"LG","HOSE - SUCTION, 1 1/2\" NH X 10', RUBBER, RCKR LUG COUPL,9 NSHT/IN",{"$f":"_xlfn.XLOOKUP(A42,'Price List'!A:A,'Price List'!B:B)","v":213.7},0,null,8.8800000000000008,0]
[1239,0,"LG","HOSE - SYNTHETIC, LINED, 1 1/2\" NH X 100'",{"$f":"_xlfn.XLOOKUP(A43,'Price List'!A:A,'Price List'!B:B)","v":239.17},0,null,12.38,0]
[1238,0,"LG","HOSE - SYNTHETIC, LINED, 1\" NPSH X 100'",{"$f":"_xlfn.XLOOKUP(A44,'Price List'!A:A,'Price List'!B:B)","v":189.13},0,null,8.3800000000000008,0]
[1808,0,"LG","HOSE, SUCTION, RUBBER, 1.5\" NH X 8'",{"$f":"_xlfn.XLOOKUP(A45,'Price List'!A:A,'Price List'!B:B)","v":181.02},0,null,7.88,0]
[2800,0,"PR","JEANS, BDU 26\"-30\" X 30\"",{"$f":"_xlfn.XLOOKUP(A46,'Price List'!A:A,'Price List'!B:B)","v":116.08},0,null,1.25,0]
[2841,0,"PR","JEANS, BDU 26\"-30\" X 36\"",{"$f":"_xlfn.XLOOKUP(A47,'Price List'!A:A,'Price List'!B:B)","v":116.08},0,null,1.25,0]
[2700,0,"PR","JEANS, BDU 26-30” X 34”",{"$f":"_xlfn.XLOOKUP(A48,'Price List'!A:A,'Price List'!B:B)","v":116.08},0,null,1.25,0]
[2801,0,"PR","JEANS, BDU 28\"-32\" X 30\"",{"$f":"_xlfn.XLOOKUP(A49,'Price List'!A:A,'Price List'!B:B)","v":116.08},{"$f":"E49*B49","v":0},null,1.25,{"$f":"B49*H49","v":0}]
[2843,0,"PR","JEANS, BDU 28\"-32\" X 36\"",{"$f":"_xlfn.XLOOKUP(A50,'Price List'!A:A,'Price List'!B:B)","v":116.08},0,null,1.25,0]
[2701,0,"PR","JEANS, BDU 28-32” X 34”",{"$f":"_xlfn.XLOOKUP(A51,'Price List'!A:A,'Price List'!B:B)","v":116.08},0,null,1.31,0]
[2844,0,"PR","JEANS, BDU 30\"-34\"  X 36\"",{"$f":"_xlfn.XLOOKUP(A52,'Price List'!A:A,'Price List'!B:B)","v":116.08},0,null,1.25,0]
[2802,0,"PR","JEANS, BDU 30\"-34\" X30\"",{"$f":"_xlfn.XLOOKUP(A53,'Price List'!A:A,'Price List'!B:B)","v":116.08},0,null,1.31,0]
[2702,0,"PR","JEANS, BDU 30-34” X 34”",{"$f":"_xlfn.XLOOKUP(A54,'Price List'!A:A,'Price List'!B:B)","v":116.08},0,null,1.25,0]
[2803,0,"PR","JEANS, BDU 32\"-36\" X 30\"",{"$f":"_xlfn.XLOOKUP(A55,'Price List'!A:A,'Price List'!B:B)","v":116.08},0,null,1.38,0]
[2845,0,"PR","JEANS, BDU 32\"-36\" X 36\"",{"$f":"_xlfn.XLOOKUP(A56,'Price List'!A:A,'Price List'!B:B)","v":116.08},0,null,1.25,0]
[2703,0,"PR","JEANS, BDU 32-36” X 34”",{"$f":"_xlfn.XLOOKUP(A57,'Price List'!A:A,'Price List'!B:B)","v":116.08},0,null,1.38,0]
[2804,0,"PR","JEANS, BDU 34\"-38\" X 30\"",{"$f":"_xlfn.XLOOKUP(A58,'Price List'!A:A,'Price List'!B:B)","v":116.08},0,null,1.38,0]
[2847,0,"PR","JEANS, BDU 34\"-38\" X 36\"",{"$f":"_xlfn.XLOOKUP(A59,'Price List'!A:A,'Price List'!B:B)","v":116.08},0,null,1.25,0]
[2704,0,"PR","JEANS, BDU 34-38” X 34”",{"$f":"_xlfn.XLOOKUP(A60,'Price List'!A:A,'Price List'!B:B)","v":116.08},0,null,1.38,0]
[2805,0,"PR","JEANS, BDU 36\"-40\" X 30\"",{"$f":"_xlfn.XLOOKUP(A61,'Price List'!A:A,'Price List'!B:B)","v":116.08},0,null,1.38,0]
[2848,0,"PR","JEANS, BDU 36\"-40\" X 36\"",{"$f":"_xlfn.XLOOKUP(A62,'Price List'!A:A,'Price List'!B:B)","v":116.08},0,null,1.25,0]
[2705,0,"PR","JEANS, BDU 36-40”  X 34”",{"$f":"_xlfn.XLOOKUP(A63,'Price List'!A:A,'Price List'!B:B)","v":116.08},0,null,1.38,0]
[2806,0,"PR","JEANS, BDU 38\"-42\" X 30\"",{"$f":"_xlfn.XLOOKUP(A64,'Price List'!A:A,'Price List'!B:B)","v":116.08},0,null,1.38,0]
[2849,0,"PR","JEANS, BDU 38\"-42\" X 36\"",{"$f":"_xlfn.XLOOKUP(A65,'Price List'!A:A,'Price List'!B:B)","v":116.08},0,null,1.25,0]
[2706,0,"PR","JEANS, BDU 38-42” X 34”",{"$f":"_xlfn.XLOOKUP(A66,'Price List'!A:A,'Price List'!B:B)","v":116.08},0,null,1.38,0]
[2807,0,"PR","JEANS, BDU 40\"-44\" X 30\"",{"$f":"_xlfn.XLOOKUP(A67,'Price List'!A:A,'Price List'!B:B)","v":116.08},0,null,1.44,0]
[2850,0,"PR","JEANS, BDU 40\"-44\" X 36\"",{"$f":"_xlfn.XLOOKUP(A68,'Price List'!A:A,'Price List'!B:B)","v":116.08},0,null,1.25,0]
[2707,0,"PR","JEANS, BDU 40-44” X 34”",{"$f":"_xlfn.XLOOKUP(A69,'Price List'!A:A,'Price List'!B:B)","v":116.08},0,null,1.25,0]
[2842,0,"PR","JEANS, BDU 44\"-48\" X 30\"",{"$f":"_xlfn.XLOOKUP(A70,'Price List'!A:A,'Price List'!B:B)","v":116.08},0,null,1.25,0]
[2846,0,"PR","JEANS, BDU 44\"-48\" X 33\"",{"$f":"_xlfn.XLOOKUP(A71,'Price List'!A:A,'Price List'!B:B)","v":116.08},0,null,1.25,0]
[2851,0,"PR","JEANS, BDU 44\"-48\" X 36\"",{"$f":"_xlfn.XLOOKUP(A72,'Price List'!A:A,'Price List'!B:B)","v":116.08},0,null,1.25,0]
[597,0,"EA","LINER - BACKPACK PUMP",{"$f":"_xlfn.XLOOKUP(A73,'Price List'!A:A,'Price List'!B:B)","v":9.66},0,null,0.88,0]
[296,0,"EA","MC LEOD W/SHEATH",{"$f":"_xlfn.XLOOKUP(A74,'Price List'!A:A,'Price List'!B:B)","v":68.489999999999995},0,null,6.19,0]
[24,0,"EA","NOZZLE - TWIN TIP, 1\" NPSH-F",{"$f":"_xlfn.XLOOKUP(A75,'Price List'!A:A,'Price List'!B:B)","v":151.16},0,null,2.25,0]
[628,0,"EA","NOZZLE - FIRE FOAM, 1.5\" NH, 16 GPM, PLASTIC",{"$f":"_xlfn.XLOOKUP(A76,'Price List'!A:A,'Price List'!B:B)","v":25.58},0,null,0.88,0]
[629,0,"EA","NOZZLE - FIRE FOAM, 1.5\" NH, 30 GPM, PLASTIC",{"$f":"_xlfn.XLOOKUP(A77,'Price List'!A:A,'Price List'!B:B)","v":31},0,null,1.1299999999999999,0]
[627,0,"EA","NOZZLE - FIRE FOAM, 3/4” NH, 8 GPM, PLASTIC",{"$f":"_xlfn.XLOOKUP(A78,'Price List'!A:A,'Price List'!B:B)","v":19.18},0,null,0.38,0]
[136,0,"EA","NOZZLE - GARDEN HOSE, 3/4\" NH, ADJUSTABLE, BRASS",{"$f":"_xlfn.XLOOKUP(A79,'Price List'!A:A,'Price List'!B:B)","v":21.96},0,null,0.44,0]
[138,0,"EA","NOZZLE - PLASTIC, 35 GPM, 1'' NPSH-F",{"$f":"_xlfn.XLOOKUP(A80,'Price List'!A:A,'Price List'!B:B)","v":8.64},{"$f":"E80*B80","v":0},null,0.5,{"$f":"B80*H80","v":0}]
[137,0,"EA","NOZZLE - PLASTIC, 60 GPM, 1 1/2'' NH-F X 4 3/4'' LONG",{"$f":"_xlfn.XLOOKUP(A81,'Price List'!A:A,'Price List'!B:B)","v":8.33},0,null,0.63,0]
[674,0,"EA","PACK, FIRELINE (BLUE), COMPLETE",{"$f":"_xlfn.XLOOKUP(A82,'Price List'!A:A,'Price List'!B:B)","v":153.13999999999999},0,null,3.69,0]
[679,0,"EA","PACK, PERSONAL GEAR, RED",{"$f":"_xlfn.XLOOKUP(A83,'Price List'!A:A,'Price List'!B:B)","v":116.62},0,null,4,0]
[146,0,"EA","PULASKI, WITH PLASTIC SHEATH",{"$f":"_xlfn.XLOOKUP(A84,'Price List'!A:A,'Price List'!B:B)","v":72.680000000000007},0,null,5.88,0]
[1149,0,"EA","PUMP – BACKPACK, OUTFIT COMPLETE",{"$f":"_xlfn.XLOOKUP(A85,'Price List'!A:A,'Price List'!B:B)","v":205.4},0,null,6.94,0]
[151,0,"EA","PUMP - TROMBONE",{"$f":"_xlfn.XLOOKUP(A86,'Price List'!A:A,'Price List'!B:B)","v":70.67},0,null,2.63,0]
[659,0,"EA","RAKE - COLLAPSIBLE",{"$f":"_xlfn.XLOOKUP(A87,'Price List'!A:A,'Price List'!B:B)","v":96.79},0,null,3.31,0]
[1807,0,"EA","RAKE, FIRE (COUNCIL TOOL) W/SHEATH",{"$f":"_xlfn.XLOOKUP(A88,'Price List'!A:A,'Price List'!B:B)","v":100.57},0,null,3.7,0]
[10,0,"EA","REDUCER - 1 1/2\" NH-F (9 TPI) TO 1\" NPSH-M (11 1/2 TPI)",{"$f":"_xlfn.XLOOKUP(A89,'Price List'!A:A,'Price List'!B:B)","v":13.52},0,null,0.19,0]
[733,0,"EA","REDUCER - 1'' NPSH-F (11 1/2 TPI) TO 3/4'' NH-M (11 1/2 TPI)",{"$f":"_xlfn.XLOOKUP(A90,'Price List'!A:A,'Price List'!B:B)","v":10.86},0,null,0.19,0]
[2230,0,"EA","REDUCER - 2 1/2'' NH-F, 1 1/2'' NH-M",{"$f":"_xlfn.XLOOKUP(A91,'Price List'!A:A,'Price List'!B:B)","v":26.87},0,null,0.88,0]
[257,0,"EA","SHEATH - PULASKI",{"$f":"_xlfn.XLOOKUP(A92,'Price List'!A:A,'Price List'!B:B)","v":4.1900000000000004},0,null,0.31,0]
[975,0,"EA","SHELTER, FIRE, LARGE, M2002, COMPLETE",{"$f":"_xlfn.XLOOKUP(A93,'Price List'!A:A,'Price List'!B:B)","v":548.21},0,null,6.38,0]
[925,0,"EA","SHELTER, FIRE, M2002, COMPLETE, REGULAR",{"$f":"_xlfn.XLOOKUP(A94,'Price List'!A:A,'Price List'!B:B)","v":500.97},0,null,5.19,0]
[579,0,"EA","SHIRT – FIRE, LARGE",{"$f":"_xlfn.XLOOKUP(A95,'Price List'!A:A,'Price List'!B:B)","v":95.54},0,null,1,0]
[578,0,"EA","SHIRT – FIRE, MEDIUM   ",{"$f":"_xlfn.XLOOKUP(A96,'Price List'!A:A,'Price List'!B:B)","v":95.54},0,null,0.94,0]
[569,0,"EA","SHIRT – FIRE, MEDIUM, LOGN",{"$f":"_xlfn.XLOOKUP(A97,'Price List'!A:A,'Price List'!B:B)","v":95.54},0,null,0.94,0]
[577,0,"EA","SHIRT – FIRE, SMALL",{"$f":"_xlfn.XLOOKUP(A98,'Price List'!A:A,'Price List'!B:B)","v":95.54},0,null,0.81,0]
[580,0,"EA","SHIRT – FIRE, X-LARGE",{"$f":"_xlfn.XLOOKUP(A99,'Price List'!A:A,'Price List'!B:B)","v":95.54},0,null,1,0]
[570,0,"EA","SHIRT – FIRE, XX-LARGE",{"$f":"_xlfn.XLOOKUP(A100,'Price List'!A:A,'Price List'!B:B)","v":95.54},0,null,1.1299999999999999,0]
[2078,0,"EA","SHIRT – LARGE, LONG",{"$f":"_xlfn.XLOOKUP(A101,'Price List'!A:A,'Price List'!B:B)","v":95.54},0,null,0.94,0]
[511,0,"EA","SHIRT – SMALL, LONG",{"$f":"_xlfn.XLOOKUP(A102,'Price List'!A:A,'Price List'!B:B)","v":95.54},0,null,0.88,0]
[2079,0,"EA","SHIRT - X-LARGE, LONG",{"$f":"_xlfn.XLOOKUP(A103,'Price List'!A:A,'Price List'!B:B)","v":95.54},0,null,1.06,0]
[522,0,"EA","SHIRT - X-SMALL",{"$f":"_xlfn.XLOOKUP(A104,'Price List'!A:A,'Price List'!B:B)","v":95.54},0,null,0.81,0]
[512,0,"EA","SHIRT – XXL, LONG",{"$f":"_xlfn.XLOOKUP(A105,'Price List'!A:A,'Price List'!B:B)","v":95.54},0,null,1.1299999999999999,0]
[2910,0,"EA","SHIRT - XXXL",{"$f":"_xlfn.XLOOKUP(A106,'Price List'!A:A,'Price List'!B:B)","v":95.54},0,null,1.25,0]
[2911,0,"EA","SHIRT – XXXL, LONG",{"$f":"_xlfn.XLOOKUP(A107,'Price List'!A:A,'Price List'!B:B)","v":95.54},0,null,1.25,0]
[171,0,"EA","SHOVEL W/SHEATH ",{"$f":"_xlfn.XLOOKUP(A108,'Price List'!A:A,'Price List'!B:B)","v":91.53},0,null,4.88,0]
[1274,0,"EA","SHROUD – FACE & NECK FF",{"$f":"_xlfn.XLOOKUP(A109,'Price List'!A:A,'Price List'!B:B)","v":33.909999999999997},{"$f":"E109*B109","v":0},null,0.13,{"$f":"B109*H109","v":0}]
[1868,0,"EA","SWATTER, FIRE",{"$f":"_xlfn.XLOOKUP(A110,'Price List'!A:A,'Price List'!B:B)","v":59.17},0,null,5.3,0]
[731,0,"EA","TEE - HOSELINE, 1 1/2\" NH-F X 1 1/2\" NH-M X 1\" NPSH-M W/CAP",{"$f":"_xlfn.XLOOKUP(A111,'Price List'!A:A,'Price List'!B:B)","v":46.7},0,null,0.38,0]
[230,0,"EA","TEE - HOSELINE, W/VALVE, 1 1/2\" NH-F X 1 1/2\" NH-M X 1\" NPSH-M",{"$f":"_xlfn.XLOOKUP(A112,'Price List'!A:A,'Price List'!B:B)","v":46.89},0,null,0.94,0]
[1180,0,"EA","TOOL - COMBINATION SHOVEL AND GRUB HOE",{"$f":"_xlfn.XLOOKUP(A113,'Price List'!A:A,'Price List'!B:B)","v":89.45},0,null,4.5,0]
[241,0,"EA","TORCH – DRIP, 1.25 GL",{"$f":"_xlfn.XLOOKUP(A114,'Price List'!A:A,'Price List'!B:B)","v":190.26},0,null,5.13,0]
[228,0,"EA","VALVE - AUTOMATIC CHECK AND BLEEDER 1 1/2\" NH-F",{"$f":"_xlfn.XLOOKUP(A115,'Price List'!A:A,'Price List'!B:B)","v":132.81},0,null,2.56,0]
[212,0,"EA","VALVE - FOOT, 1 1/2\" NH-F W/STRAINER",{"$f":"_xlfn.XLOOKUP(A116,'Price List'!A:A,'Price List'!B:B)","v":90.5},0,null,1.88,0]
[231,0,"EA","VALVE - WYE, GATED, 1 1/2'' NH-F X 1 1/2'' NH-M X 1 1/2'' NH-M",{"$f":"_xlfn.XLOOKUP(A117,'Price List'!A:A,'Price List'!B:B)","v":125.1},0,null,3.75,0]
[259,0,"EA","VALVE - WYE, GATED, 1\" NPSH-F X 1\" NPSH-M X 1\" NPSH-M",{"$f":"_xlfn.XLOOKUP(A118,'Price List'!A:A,'Price List'!B:B)","v":118.33},0,null,2.44,0]
[229,0,"EA","VALVE PRESSURE RELIEF 1.5 NH-F",{"$f":"_xlfn.XLOOKUP(A119,'Price List'!A:A,'Price List'!B:B)","v":99.76},0,null,1.38,0]
[235,0,"EA","WRENCH - SPANNER, 11\", 1 1/2\" TO 2 1/2\" HOSE SIZE",{"$f":"_xlfn.XLOOKUP(A120,'Price List'!A:A,'Price List'!B:B)","v":10.07},0,null,0.63,0]
[234,0,"EA","WRENCH - SPANNER, 5\", 1\" TO 1 1/2\" HOSE SIZE",{"$f":"_xlfn.XLOOKUP(A121,'Price List'!A:A,'Price List'!B:B)","v":6.46},0,null,0.38,0]
[null,0,null,null,{"$f":"_xlfn.XLOOKUP(A122,'Price List'!A:A,'Price List'!B:B)","v":0},0,null,0,0]
[null,0,null,null,{"$f":"_xlfn.XLOOKUP(A123,'Price List'!A:A,'Price List'!B:B)","v":0},0,null,0,0]
[null,0,null,null,{"$f":"_xlfn.XLOOKUP(A124,'Price List'!A:A,'Price List'!B:B)","v":0},0,null,0,0]
[null,0,null,null,{"$f":"_xlfn.XLOOKUP(A125,'Price List'!A:A,'Price List'!B:B)","v":0},0,null,0,0]
[null,0,null,null,{"$f":"_xlfn.XLOOKUP(A126,'Price List'!A:A,'Price List'!B:B)","v":0},0,null,0,0]
[null,1,null,null,"Product Cost",{"$f":"SUM(F14:F126)","v":0},null,"Total Weight",{"$f":"SUM(I14:I126)","v":0}]
[null,1,null,null,"Estimated Shipping Costs (minimum shipping charge $10.00)",{"$f":"IF(I128=TRUE,10,H128)","v":10},null,{"$f":"SUM(I127*0.8)","v":0},{"$f":"IF(H128<10,TRUE,FALSE)","v":true}]
[null,1,null,null,"Total",{"$f":"SUM(F127:F128)","v":10}]

{"sheet":"Price List","index":1,"n_rows":1236,"n_cols":3,"rows_kept":1236,"cut":false,"hidden":false,"merged":[]}
[2,4.32,{"$f":"TRIM(A1)","v":"2"}]
[3,4.95]
[4,5.01]
[6,16.05]
[7,16.05]
[9,29.92]
[10,13.52]
[10,13.52]
[11,66.3]
[14,10.41]
[16,39.020000000000003]
[18,249.51]
[21,32]
[22,62.66]
[24,151.16]
[30,9.4600000000000009]
[30,9.4600000000000009]
[33,17.579999999999998]
[35,8.3699999999999992]
[37,2.11]
[38,10.48]
[45,143.32]
[46,53.94]
[47,43.49]
[48,211.88]
[49,14.05]
[52,5.01]
[53,97.21]
[59,10.17]
[60,3.26]
[61,6.21]
[63,2.46]
[67,31.34]
[70,689.39]
[71,7.28]
[77,204.13]
[78,143.32]
[82,85.38]
[83,63.33]
[84,689.68]
[86,6.99]
[89,191.48]
[90,859.06]
[105,143.16999999999999]
[113,57.72]
[114,38.909999999999997]
[115,213.7]
[126,7.34]
[128,121.62]
[131,0.92]
[135,80.78]
[135,80.78]
[136,21.96]
[136,21.96]
[137,8.33]
[138,8.64]
[141,10.87]
[141,10.87]
[142,66.34]
[143,67.67]
[144,80.97]
[145,106.77]
[146,72.680000000000007]
[148,5354.46]
[148,5354.46]
[148,5354.46]
[148,5354.46]
[148,5354.46]
[149,267.67]
[150,143.32]
[151,70.67]
[159,1085.51]
[159,1085.51]
[171,91.53]
[177,6.39]
[178,1.47]
[184,12.03]
[185,6.5]
[186,12.89]
[189,0.71]
[196,11.91]
[197,4.32]
[206,0.25]
[208,55.98]
[210,12.31]
[212,90.5]
[213,4.6500000000000004]
[215,5.82]
[216,0.36]
[218,175.88]
[218,175.88]
[222,5.34]
[223,434.1]
[224,0]
[224,0]
[225,35.020000000000003]
[228,132.81]
[229,99.76]
[230,46.89]
[231,125.1]
[234,6.46]
[234,6.46]
[235,10.07]
[240,35.83]
[241,190.26]
[248,11.34]
[250,18.57]
[251,2.37]
[251,2.37]
[254,0.37]
[256,2.44]
[257,4.1900000000000004]
[258,73.83]
[259,118.33]
[260,132.78]
[261,7.89]
[262,8.16]
[263,5.86]
[264,0.84]
[267,3.62]
[268,38.799999999999997]
[273,7.51]
[278,2.4]
[279,2.21]
[281,34.659999999999997]
[287,0.01]
[288,17.36]
[290,8.18]
[291,9.17]
[293,7.24]
[294,20.03]
[296,68.489999999999995]
[299,14.15]
[305,52.58]
[307,123.36]
[308,85.7]
[315,5.97]
[316,16.600000000000001]
[317,34.96]
[318,22.02]
[318,22.02]
[320,699.36]
[321,10.41]
[322,23.79]
[324,17.68]
[325,15.38]
[328,0.13]
[329,14.07]
[332,13.59]
[332,13.59]
[333,42.32]
[336,1.94]
[340,1783.92]
[342,55.58]
[344,3.14]
[345,1.49]
[346,6.53]
[347,27.5]
[348,8.8000000000000007]
[350,108.47]
[351,2.38]
[358,2.72]
[364,9.5500000000000007]
[365,0.79]
[366,0.83]
[367,1.07]
[371,64.97]
[372,0.14000000000000001]
[373,1.5]
[374,2.5299999999999998]
[375,2.39]
[376,1.27]
[377,2.11]
[378,1.49]
[379,0.73]
[381,0.06]
[382,16.559999999999999]
[383,35.119999999999997]
[384,40.090000000000003]
[385,8.2100000000000009]
[386,1.41]
[386,1.41]
[390,1224.71]
[394,7.0000000000000007E-2]
[401,0.03]
[410,79.41]
[415,0.72]
[416,16.53]
[417,27.04]
[418,11.85]
[420,7.41]
[422,21.86]
[424,14.98]
[426,372.41]
[428,7.13]
[429,9.65]
[435,393.15]
[437,233.33]
[437,233.33]
[438,42.97]
[439,21]
[440,74.75]
[443,5.33]
[445,113.23]
[446,1.22]
[447,0.87]
[448,0.92]
[453,17.48]
[459,1.91]
[464,57.56]
[465,93.6]
[468,4.93]
[471,158.46]
[473,11.19]
[474,4.76]
[475,4.62]
[476,5.23]
[478,3.67]
[480,1766.51]
[481,499.64]
[482,209.25]
[483,0.12]
[484,35.35]
[485,62.3]
[487,16.149999999999999]
[488,156.09]
[490,39.78]
[491,39.97]
[494,8.09]
[495,13.67]
[496,8.91]
[497,0.11]
[498,0.02]
[499,0.09]
[500,21.21]
[501,181.41]
[507,181.41]
[508,181.41]
[509,181.41]
[510,44.85]
[511,95.54]
[512,95.54]
[514,181.41]
[515,7.21]
[516,4.5599999999999996]
[517,181.41]
[518,181.41]
[519,181.41]
[520,6250.69]
[521,181.41]
[522,95.54]
[523,10.31]
[523,10.31]
[525,181.41]
[526,329.15]
[527,181.41]
[528,152.55000000000001]
[529,7.63]
[531,1004.86]
[532,53.57]
[533,172.28]
[534,9.31]
[535,45.22]
[536,18.55]
[537,140.65]
[538,0.53]
[539,181.41]
[542,3.01]
[542,3.01]
[543,7.91]
[544,27.89]
[545,181.41]
[546,181.41]
[547,181.41]
[548,181.41]
[551,12.01]
[557,39.979999999999997]
[558,6.19]
[559,8.0299999999999994]
[560,40.19]
[562,2.78]
[563,124.46]
[564,7.18]
[565,44.42]
[566,2.34]
[567,181.41]
[569,95.54]
[570,95.54]
[572,181.41]
[573,16.52]
[574,181.41]
[575,14.74]
[576,181.41]
[577,95.54]
[578,95.54]
[578,95.54]
[579,95.54]
[580,95.54]
[586,139.26]
[587,63.75]
[588,499.77]
[588,499.77]
[589,698.93]
[589,698.93]
[591,0.73]
[592,3.81]
[593,2.61]
[594,3.84]
[595,9.98]
[596,3.27]
[597,9.66]
[598,104.84]
[599,2.5499999999999998]
[604,0.93]
[605,8.3800000000000008]
[606,214.65]
[609,6.92]
[610,0.04]
[615,21.24]
[618,285.02999999999997]
[619,6.47]
[620,13.06]
[627,19.18]
[628,25.58]
[629,31]
[635,27.11]
[636,35.44]
[637,10.14]
[638,17.34]
[639,3.06]
[640,54.94]
[643,11.24]
[645,9.3800000000000008]
[645,9.3800000000000008]
[646,1.61]
[650,1246.1199999999999]
[652,56.51]
[652,56.51]
[656,27.35]
[657,6.01]
[659,96.79]
[661,825.06]
[661,825.06]
[662,176.17]
[664,946.8]
[664,946.8]
[665,4349.4799999999996]
[665,4349.4799999999996]
[666,44.2]
[668,762.06]
[674,153.13999999999999]
[674,153.13999999999999]
[675,12.05]
[676,61.51]
[678,503]
[679,116.62]
[684,15.78]
[685,76.349999999999994]
[687,88.52]
[689,0.18]
[690,10.58]
[692,286.18]
[693,50.62]
[693,50.62]
[694,0.08]
[706,8.69]
[707,45.51]
[709,2477.1799999999998]
[709,2477.1799999999998]
[710,17.11]
[712,2.0699999999999998]
[714,1.83]
[718,57.15]
[720,25.47]
[720,25.47]
[721,0.24]
[721,0.24]
[725,0.14000000000000001]
[727,0.31]
[727,0.31]
[729,0.52]
[731,46.7]
[732,16.739999999999998]
[733,10.86]
[733,10.86]
[735,37.299999999999997]
[736,10.02]
[737,15.7]
[741,43.9]
[742,1.44]
[743,0.48]
[744,94.55]
[745,3.68]
[746,0.32]
[747,6.34]
[748,6.32]
[751,3.8]
[758,64.73]
[760,608.63]
[763,8.9499999999999993]
{"$rows_left_out":836}